BDBM50155479 2-[1-(4-Hydroxy-phenyl)-meth-(E)-ylidene]-6-methoxy-3,4-dihydro-2H-naphthalen-1-one::2-[1-(4-hydroxyphenyl)methylidene]-6-methoxy-3,4-dihydro-2H-naphthalen-1-one::CHEMBL426432
SMILES COc1ccc2C(=O)\C(CCc2c1)=C\c1ccc(O)cc1
InChI Key InChIKey=XQNOKJZNMHDSFF-GXDHUFHOSA-N
Data  1 IC50
  Tab Delimited (TSV)   2D SDfile   Computed 3D by Vconf -m prep SDfile
Find this compound or compounds like it in BindingDB:
Activity Spreadsheet -- Enzyme Inhibition Constant Data from BindingDB
Found 1 hit for monomerid = 50155479
Target1,25-dihydroxyvitamin D(3) 24-hydroxylase, mitochondrial(Rattus norvegicus)
Cardiff University
Curated by ChEMBL
LigandPNGBDBM50155479(2-[1-(4-Hydroxy-phenyl)-meth-(E)-ylidene]-6-methox...)
Affinity DataIC50: >2.00E+4nM. Assay description: Inhibitory activity against 25-hydroxyvitamin D3 24-hydroxylase of rat kidney mitochondria
In DepthDetails ArticlePubMed