BDBM50155734 1-[1-(2,2-Diphenyl-ethyl)-6,8-dimethoxy-3,4-dihydro-1H-isoquinolin-2-yl]-ethanone::CHEMBL187136
SMILES COc1cc2CCN(C(CC(c3ccccc3)c3ccccc3)c2c(OC)c1)C(C)=O
InChI Key InChIKey=GDUUJQHYQZBCSG-UHFFFAOYSA-N
Data  2 IC50
  Tab Delimited (TSV)   2D SDfile   Computed 3D by Vconf -m prep SDfile
Find this compound or compounds like it in BindingDB:
Activity Spreadsheet -- Enzyme Inhibition Constant Data from BindingDB
Found 2 hits for monomerid = 50155734
TargetMelatonin receptor type 1B(Homo sapiens (Human))
Bristol-Myers Squibb Pharmaceutical Research Institute
Curated by ChEMBL
LigandPNGBDBM50155734(1-[1-(2,2-Diphenyl-ethyl)-6,8-dimethoxy-3,4-dihydr...)
Affinity DataIC50:  45nM. Assay description: Inhibitory concentration against Melatonin receptor type 1B
In DepthDetails ArticlePubMed
TargetMelatonin receptor type 1A(Homo sapiens (Human))
Bristol-Myers Squibb Pharmaceutical Research Institute
Curated by ChEMBL
LigandPNGBDBM50155734(1-[1-(2,2-Diphenyl-ethyl)-6,8-dimethoxy-3,4-dihydr...)
Affinity DataIC50: >1.00E+3nM. Assay description: Inhibitory concentration against Melatonin receptor type 1A
In DepthDetails ArticlePubMed