BDBM50155819 CHEMBL188396::N-(5-tert-Butyl-[1,3,4]thiadiazol-2-yl)-2-cyano-3-{4-[2-(2,6-dimethyl-phenoxy)-ethoxy]-3-methoxy-phenyl}-acrylamide
SMILES COc1cc(\C=C(/C#N)C(=O)Nc2nnc(s2)C(C)(C)C)ccc1OCCOc1c(C)cccc1C
InChI Key InChIKey=PUYORRFYMDYWPL-XSFVSMFZSA-N
Data  1 IC50
  Tab Delimited (TSV)   2D SDfile   Computed 3D by Vconf -m prep SDfile
Find this compound or compounds like it in BindingDB:
Activity Spreadsheet -- Enzyme Inhibition Constant Data from BindingDB
Found 1 hit for monomerid = 50155819
TargetSteroid hormone receptor ERR1(Homo sapiens (Human))
X-Ceptor Therapeutics
Curated by ChEMBL
LigandPNGBDBM50155819(CHEMBL188396 | N-(5-tert-Butyl-[1,3,4]thiadiazol-2...)
Affinity DataIC50:  1.70E+3nM. Assay description: Inhibition of estrogen-related receptor alpha Gal4 activity
In DepthDetails ArticlePubMed