BDBM50155857 CHEMBL3781095
SMILES CCN1C(=O)c2cccc3c(NS(=O)(=O)c4cccc(Cl)c4Cl)ccc1c23
InChI Key InChIKey=QNQHDAZJUOGDRI-UHFFFAOYSA-N
Data  1 IC50
  Tab Delimited (TSV)   2D SDfile   Computed 3D by Vconf -m prep SDfile
Find this compound or compounds like it in BindingDB:
Activity Spreadsheet -- Enzyme Inhibition Constant Data from BindingDB
Found 1 hit for monomerid = 50155857
TargetBromodomain-containing protein 4(Homo sapiens (Human))
Guangzhou Institutes Of Biomedicine And Health
Curated by ChEMBL
LigandPNGBDBM50155857(CHEMBL3781095)
Affinity DataIC50:  2.55E+3nM. Assay description: Inhibition of human His6-tagged BRD4 bromodomain 1 (N44 to E168 residues) expressed in Escherichia coli BL21(DE3) cells using biotin-H4KAc4 as substr...
In DepthDetails ArticlePubMed