BDBM50155944 CHEMBL3234250
SMILES CCN1C(=O)c2cccc3c(ccc1c23)S(=O)(=O)NC1CCN(CC1)C(=O)OC(C)(C)C
InChI Key InChIKey=SUWMJYQWQJBQFS-UHFFFAOYSA-N
Data  1 IC50
  Tab Delimited (TSV)   2D SDfile   Computed 3D by Vconf -m prep SDfile
Find this compound or compounds like it in BindingDB:
Activity Spreadsheet -- Enzyme Inhibition Constant Data from BindingDB
Found 1 hit for monomerid = 50155944
TargetBromodomain-containing protein 4(Homo sapiens (Human))
Guangzhou Institutes Of Biomedicine And Health
Curated by ChEMBL
LigandPNGBDBM50155944(CHEMBL3234250)
Affinity DataIC50:  1.69E+3nM. Assay description: Inhibition of human His6-tagged BRD4 bromodomain 1 (N44 to E168 residues) expressed in Escherichia coli BL21(DE3) cells using biotin-H4KAc4 as substr...
In DepthDetails ArticlePubMed