BDBM50156032 Benzoic acid 2-[4-(4-chloro-phenyl)-1-methyl-piperidin-3-ylmethylsulfanyl]-ethyl ester::CHEMBL373127
SMILES CN1CCC(C(CSCCOC(=O)c2ccccc2)C1)c1ccc(Cl)cc1
InChI Key InChIKey=GBRACIWJCUBBNF-UHFFFAOYSA-N
Data  3 KI
  Tab Delimited (TSV)   2D SDfile   Computed 3D by Vconf -m prep SDfile
Find this compound or compounds like it in BindingDB:
Activity Spreadsheet -- Enzyme Inhibition Constant Data from BindingDB
Found 3 hits for monomerid = 50156032
TargetTransporter(Rattus norvegicus)
Acenta Discovery
Curated by ChEMBL
LigandPNGBDBM50156032(Benzoic acid 2-[4-(4-chloro-phenyl)-1-methyl-piper...)
Affinity DataKi:  4.5nM. Assay description: Inhibition of high affinity uptake by the norepinephrine transporter from rat synaptosomal nerve endings by using [3H]NE as radioligand
In DepthDetails ArticlePubMed
TargetSodium-dependent serotonin transporter(Rattus norvegicus (rat))
Acenta Discovery
Curated by ChEMBL
LigandPNGBDBM50156032(Benzoic acid 2-[4-(4-chloro-phenyl)-1-methyl-piper...)
Affinity DataKi:  6.70nM. Assay description: Inhibition of high affinity uptake by the serotonin transporter (5-HT) from rat synaptosomal nerve endings by using [3H]5-HT as radioligand
In DepthDetails ArticlePubMed
TargetSodium-dependent dopamine transporter(Rattus norvegicus (rat))
Acenta Discovery
Curated by ChEMBL
LigandPNGBDBM50156032(Benzoic acid 2-[4-(4-chloro-phenyl)-1-methyl-piper...)
Affinity DataKi:  68nM. Assay description: Inhibition of high affinity uptake by the dopamine transporter from rat synaptosomal nerve endings by using [3H]DA as radioligand
In DepthDetails ArticlePubMed