BDBM50156335 CHEMBL3781076
SMILES CNc1ncc(c(CC2CC2)n1)-c1ccnc(NCCCO)n1
InChI Key InChIKey=IHRULQONDDTIOW-UHFFFAOYSA-N
Data  1 IC50
  Tab Delimited (TSV)   2D SDfile   Computed 3D by Vconf -m prep SDfile
Find this compound or compounds like it in BindingDB:
Activity Spreadsheet -- Enzyme Inhibition Constant Data from BindingDB
Found 1 hit for monomerid = 50156335
TargetPhosphatidylinositol 3-kinase catalytic subunit type 3(Homo sapiens (Human))
Novartis Institutes For Biomedical Research
Curated by ChEMBL
LigandPNGBDBM50156335(CHEMBL3781076)
Affinity DataIC50:  6.30E+3nM. Assay description: Inhibition of recombinant human VPS34 using L-alpha-phosphatidylinositol as substrate incubated for 10 mins by luminescence based ATP detection assay
In DepthDetails ArticlePubMed