BDBM50156350 CHEMBL3785199
SMILES COCCOc1cnc2ccn([C@H](C)c3nnc4c(F)cc(cn34)-c3cc(C)no3)c(=O)c2c1
InChI Key InChIKey=IASNQBJQLURUKC-CQSZACIVSA-N
Data  2 IC50
  Tab Delimited (TSV)   2D SDfile   Computed 3D by Vconf -m prep SDfile
Find this compound or compounds like it in BindingDB:
Activity Spreadsheet -- Enzyme Inhibition Constant Data from BindingDB
Found 2 hits for monomerid = 50156350
TargetHepatocyte growth factor receptor(Homo sapiens (Human))
Amgen
Curated by ChEMBL
LigandPNGBDBM50156350(CHEMBL3785199)
Affinity DataIC50:  1nM. Assay description: Inhibition of recombinant MET (unknown origin) using gastrin peptide as substrate preincubated for 30 mins followed by substrate addition incubated f...
In DepthDetails ArticlePubMed
TargetHepatocyte growth factor receptor(Homo sapiens (Human))
Amgen
Curated by ChEMBL
LigandPNGBDBM50156350(CHEMBL3785199)
Affinity DataIC50:  1nM. Assay description: Inhibition of recombinant MET (unknown origin) using gastrin peptide as substrate preincubated for 30 mins followed by substrate addition incubated f...
In DepthDetails ArticlePubMed