BDBM50156464 CHEMBL3793652
SMILES COc1ccc(cc1O)-c1nnc2n(C)c(=O)c3ccccc3n12
InChI Key InChIKey=NCBIGGVEVRXKOH-UHFFFAOYSA-N
Data  1 IC50
  Tab Delimited (TSV)   2D SDfile   Computed 3D by Vconf -m prep SDfile
Find this compound or compounds like it in BindingDB:
Activity Spreadsheet -- Enzyme Inhibition Constant Data from BindingDB
Found 1 hit for monomerid = 50156464
TargetSimilar to alpha-tubulin isoform 1(Bos taurus)
Universities Of Lille
Curated by ChEMBL
LigandPNGBDBM50156464(CHEMBL3793652)
Affinity DataIC50:  150nM. Assay description: Inhibition of bovine tubulin polymerization after 1 hr by fluorescence spectrometry
In DepthDetails ArticlePubMed