BDBM50156540 CHEMBL3793802
SMILES [H][C@]12C[C@@H](O)[C@H](COc3ccc(Cl)c(Cl)c3)[C@@]1([H])CC[C@@H](O2)c1nc(cs1)C(O)=O
InChI Key InChIKey=YIRCUUSFZMICAC-DANSYUPJSA-N
Data  2 EC50
  Tab Delimited (TSV)   2D SDfile   Computed 3D by Vconf -m prep SDfile
Find this compound or compounds like it in BindingDB:
Activity Spreadsheet -- Enzyme Inhibition Constant Data from BindingDB
Found 2 hits for monomerid = 50156540
TargetProstaglandin E2 receptor EP2 subtype(Homo sapiens (Human))
Ono Pharmaceutical
Curated by ChEMBL
LigandPNGBDBM50156540(CHEMBL3793802)
Affinity DataEC50: >1.00E+4nM. Assay description: Agonist activity at human EP2 receptor expressed in HEK293 cells after 24 hrs beta-arrestin recruitment assay
In DepthDetails ArticlePubMed
TargetProstaglandin E2 receptor EP2 subtype(Homo sapiens (Human))
Ono Pharmaceutical
Curated by ChEMBL
LigandPNGBDBM50156540(CHEMBL3793802)
Affinity DataEC50:  0.570nM. Assay description: Agonist activity at human EP2 receptor expressed in CHO cells assessed as cAMP level by HTRF assay
In DepthDetails ArticlePubMed