BDBM50156740 3-(4-amino-6-(((1S,2R,5S)-6,6-dimethylbicyclo[3.1.1]heptan-2-yl)methylamino)-1,3,5-triazin-2-ylamino)-4-methylbenzamide::CHEMBL222785
SMILES Cc1ccc(cc1Nc1nc(N)nc(NC[C@@H]2CC[C@H]3C[C@@H]2C3(C)C)n1)C(N)=O
InChI Key InChIKey=PHIMSHRJTQBOPK-KKUMJFAQSA-N
Data  1 IC50
  Tab Delimited (TSV)   2D SDfile   Computed 3D by Vconf -m prep SDfile
Find this compound or compounds like it in BindingDB:
Activity Spreadsheet -- Enzyme Inhibition Constant Data from BindingDB
Found 1 hit for monomerid = 50156740
TargetMitogen-activated protein kinase 14(Homo sapiens (Human))
Bristol-Myers Squibb
Curated by ChEMBL
LigandPNGBDBM50156740(3-(4-amino-6-(((1S,2R,5S)-6,6-dimethylbicyclo[3.1....)
Affinity DataIC50:  5.90E+3nM. Assay description: Inhibition of human p38-alpha expressed in Escherichia coli
In DepthDetails ArticlePubMed