BDBM50157060 (S)-2-Methoxy-3-{4-[4-(4-phenoxy-phenoxy)-but-1-ynyl]-phenyl}-propionic acid::CHEMBL181656
SMILES CO[C@@H](Cc1ccc(cc1)C#CCCOc1ccc(Oc2ccccc2)cc1)C(O)=O
InChI Key InChIKey=PXPYSVWYMMGIEN-VWLOTQADSA-N
Data  6 IC50  2 EC50
  Tab Delimited (TSV)   2D SDfile   Computed 3D by Vconf -m prep SDfile
Find this compound or compounds like it in BindingDB:
Activity Spreadsheet -- Enzyme Inhibition Constant Data from BindingDB
Found 8 hits for monomerid = 50157060
TargetPeroxisome proliferator-activated receptor alpha(Homo sapiens (Human))
Eli Lilly
Curated by ChEMBL
LigandPNGBDBM50157060((S)-2-Methoxy-3-{4-[4-(4-phenoxy-phenoxy)-but-1-yn...)
Affinity DataEC50:  1.88E+3nM. Assay description: Mean effective concentration against human peroxisome proliferator activated receptor alpha
In DepthDetails ArticlePubMed
TargetPeroxisome proliferator-activated receptor gamma(Homo sapiens (Human))
Eli Lilly
Curated by ChEMBL
LigandPNGBDBM50157060((S)-2-Methoxy-3-{4-[4-(4-phenoxy-phenoxy)-but-1-yn...)
Affinity DataEC50:  103nM. Assay description: Mean effective concentration against human peroxisome proliferator-activated receptor gamma
In DepthDetails ArticlePubMed
TargetPeroxisome proliferator-activated receptor delta(Homo sapiens (Human))
Eli Lilly
Curated by ChEMBL
LigandPNGBDBM50157060((S)-2-Methoxy-3-{4-[4-(4-phenoxy-phenoxy)-but-1-yn...)
Affinity DataIC50:  3.94E+3nM. Assay description: Mean inhibitory concentration against human peroxisome proliferator-activated receptor delta
In DepthDetails ArticlePubMed
TargetPeroxisome proliferator-activated receptor gamma(Homo sapiens (Human))
Eli Lilly
Curated by ChEMBL
LigandPNGBDBM50157060((S)-2-Methoxy-3-{4-[4-(4-phenoxy-phenoxy)-but-1-yn...)
Affinity DataIC50:  13nM. Assay description: Agonist activity at PPARgamma
In DepthDetails ArticlePubMed
TargetPeroxisome proliferator-activated receptor alpha(Homo sapiens (Human))
Eli Lilly
Curated by ChEMBL
LigandPNGBDBM50157060((S)-2-Methoxy-3-{4-[4-(4-phenoxy-phenoxy)-but-1-yn...)
Affinity DataIC50:  1.15E+3nM. Assay description: Mean inhibitory concentration against human peroxisome proliferator activated receptor alpha
In DepthDetails ArticlePubMed
TargetPeroxisome proliferator-activated receptor alpha(Homo sapiens (Human))
Eli Lilly
Curated by ChEMBL
LigandPNGBDBM50157060((S)-2-Methoxy-3-{4-[4-(4-phenoxy-phenoxy)-but-1-yn...)
Affinity DataIC50:  1.15E+3nM. Assay description: Agonist activity at PPARalpha
In DepthDetails ArticlePubMed
TargetPeroxisome proliferator-activated receptor delta(Homo sapiens (Human))
Eli Lilly
Curated by ChEMBL
LigandPNGBDBM50157060((S)-2-Methoxy-3-{4-[4-(4-phenoxy-phenoxy)-but-1-yn...)
Affinity DataIC50:  3.94E+3nM. Assay description: Agonist activity at PPARdelta
In DepthDetails ArticlePubMed
TargetPeroxisome proliferator-activated receptor gamma(Homo sapiens (Human))
Eli Lilly
Curated by ChEMBL
LigandPNGBDBM50157060((S)-2-Methoxy-3-{4-[4-(4-phenoxy-phenoxy)-but-1-yn...)
Affinity DataIC50:  13nM. Assay description: Mean inhibitory concentration against human peroxisome proliferator-activated receptor gamma
In DepthDetails ArticlePubMed