BDBM50157285 5-[(3,4-Dichloro-benzyloxy)-(3-methyl-3H-imidazol-4-yl)-methyl]-2''-trifluoromethyl-biphenyl-2-carbonitrile::CHEMBL183097
SMILES Cn1cncc1C(OCc1ccc(Cl)c(Cl)c1)c1ccc(C#N)c(c1)-c1ccccc1C(F)(F)F
InChI Key InChIKey=UHRAFDSLBQHPNH-UHFFFAOYSA-N
Data  2 IC50
  Tab Delimited (TSV)   2D SDfile   Computed 3D by Vconf -m prep SDfile
Find this compound or compounds like it in BindingDB:
Activity Spreadsheet -- Enzyme Inhibition Constant Data from BindingDB
Found 2 hits for monomerid = 50157285
LigandPNGBDBM50157285(5-[(3,4-Dichloro-benzyloxy)-(3-methyl-3H-imidazol-...)
Affinity DataIC50:  72nM. Assay description: Inhibition of Bovine Geranyl geranyl transeferase
In DepthDetails ArticlePubMed
LigandPNGBDBM50157285(5-[(3,4-Dichloro-benzyloxy)-(3-methyl-3H-imidazol-...)
Affinity DataIC50:  1.70nM. Assay description: Inhibition of Bovine farnesyl transeferase
In DepthDetails ArticlePubMed