BDBM50157354 1-{4-[4-(2-Isopropyl-phenylsulfanyl)-3-trifluoromethyl-phenyl]-pyridin-2-yl}-pyrrolidin-3-ol::CHEMBL360098
SMILES CC(C)c1ccccc1Sc1ccc(cc1C(F)(F)F)-c1ccnc(c1)N1CCC(O)C1
InChI Key InChIKey=ASEPTZPIYTWOSV-UHFFFAOYSA-N
Data  1 IC50
  Tab Delimited (TSV)   2D SDfile   Computed 3D by Vconf -m prep SDfile
Find this compound or compounds like it in BindingDB:
Activity Spreadsheet -- Enzyme Inhibition Constant Data from BindingDB
Found 1 hit for monomerid = 50157354
TargetIntegrin alpha-L/Intercellular adhesion molecule 1(Homo sapiens (Human))
Abbott Laboratories
Curated by ChEMBL
LigandPNGBDBM50157354(1-{4-[4-(2-Isopropyl-phenylsulfanyl)-3-trifluorome...)
Affinity DataIC50:  93nM. Assay description: Inhibitory concentration against integrin LFA-1/ICAM-1 binding complex
In DepthDetails ArticlePubMed