BDBM50157374 4-[4-(2-Isopropyl-phenylsulfanyl)-3-trifluoromethyl-phenyl]-6-[4-(2H-tetrazol-5-yl)-piperidin-1-yl]-pyrimidine::CHEMBL183680
SMILES CC(C)c1ccccc1Sc1ccc(cc1C(F)(F)F)-c1cc(ncn1)N1CCC(CC1)c1nnn[nH]1
InChI Key InChIKey=BKXTXBYRPWNSJQ-UHFFFAOYSA-N
Data  1 IC50
  Tab Delimited (TSV)   2D SDfile   Computed 3D by Vconf -m prep SDfile
Find this compound or compounds like it in BindingDB:
Activity Spreadsheet -- Enzyme Inhibition Constant Data from BindingDB
Found 1 hit for monomerid = 50157374
TargetIntegrin alpha-L/Intercellular adhesion molecule 1(Homo sapiens (Human))
Abbott Laboratories
Curated by ChEMBL
LigandPNGBDBM50157374(4-[4-(2-Isopropyl-phenylsulfanyl)-3-trifluoromethy...)
Affinity DataIC50:  108nM. Assay description: Inhibitory concentration against integrin LFA-1/ICAM-1 binding complex
In DepthDetails ArticlePubMed