BDBM50157394 ((R)-1-{4-[4-(2-Methoxy-phenylsulfanyl)-3-trifluoromethyl-phenyl]-pyridin-2-yl}-pyrrolidin-2-yl)-methanol::CHEMBL183597
SMILES COc1ccccc1Sc1ccc(cc1C(F)(F)F)-c1ccnc(c1)N1CCC[C@@H]1CO
InChI Key InChIKey=WUFSAKWUUGHJKE-GOSISDBHSA-N
Data  1 IC50
  Tab Delimited (TSV)   2D SDfile   Computed 3D by Vconf -m prep SDfile
Find this compound or compounds like it in BindingDB:
Activity Spreadsheet -- Enzyme Inhibition Constant Data from BindingDB
Found 1 hit for monomerid = 50157394
TargetIntegrin alpha-L/Intercellular adhesion molecule 1(Homo sapiens (Human))
Abbott Laboratories
Curated by ChEMBL
LigandPNGBDBM50157394(((R)-1-{4-[4-(2-Methoxy-phenylsulfanyl)-3-trifluor...)
Affinity DataIC50:  331nM. Assay description: Inhibitory concentration against integrin LFA-1/ICAM-1 binding complex
In DepthDetails ArticlePubMed