BDBM50157424 4''-[4-(2-Isopropyl-phenylsulfanyl)-3-trifluoromethyl-phenyl]-3,4,5,6-tetrahydro-2H-[1,2'']bipyridinyl::CHEMBL434327
SMILES CC(C)c1ccccc1Sc1ccc(cc1C(F)(F)F)-c1ccnc(c1)N1CCCCC1
InChI Key InChIKey=IOBIQCAVWCTRDY-UHFFFAOYSA-N
Data  1 IC50
  Tab Delimited (TSV)   2D SDfile   Computed 3D by Vconf -m prep SDfile
Find this compound or compounds like it in BindingDB:
Activity Spreadsheet -- Enzyme Inhibition Constant Data from BindingDB
Found 1 hit for monomerid = 50157424
TargetIntegrin alpha-L/Intercellular adhesion molecule 1(Homo sapiens (Human))
Abbott Laboratories
Curated by ChEMBL
LigandPNGBDBM50157424(4''-[4-(2-Isopropyl-phenylsulfanyl)-3-trifluoromet...)
Affinity DataIC50:  1.00E+3nM. Assay description: Inhibitory concentration against integrin LFA-1/ICAM-1 binding complex
In DepthDetails ArticlePubMed