BDBM50157565 2-(3,4-dimethoxyphenyl)-7,8-dihydroxy-4H-chromen-4-one::CHEMBL221503
SMILES COc1ccc(cc1OC)-c1cc(=O)c2ccc(O)c(O)c2o1
InChI Key InChIKey=XVNXPCHSBDFEMH-UHFFFAOYSA-N
Data  1 IC50
  Tab Delimited (TSV)   2D SDfile   Computed 3D by Vconf -m prep SDfile
Find this compound or compounds like it in BindingDB:
Activity Spreadsheet -- Enzyme Inhibition Constant Data from BindingDB
Found 1 hit for monomerid = 50157565
TargetTelomerase reverse transcriptase(Homo sapiens (Human))
Bu-Nerviano Medical Sciences
Curated by ChEMBL
LigandPNGBDBM50157565(2-(3,4-dimethoxyphenyl)-7,8-dihydroxy-4H-chromen-4...)
Affinity DataIC50:  1.17E+4nM. Assay description: Inhibition of human telomerase from HEK293 cell extracts by Flash-Plate assay
In DepthDetails ArticlePubMed