BDBM50157954 4-(4-Methyl-piperidin-1-yl)-N-(4-sulfamoyl-phenyl)-butyramide::CHEMBL182185
SMILES CC1CCN(CCCC(=O)Nc2ccc(cc2)S(N)(=O)=O)CC1
InChI Key InChIKey=WKAFHOCLSQSSNS-UHFFFAOYSA-N
Data  3 KI
  Tab Delimited (TSV)   2D SDfile   Computed 3D by Vconf -m prep SDfile
Find this compound or compounds like it in BindingDB:
Activity Spreadsheet -- Enzyme Inhibition Constant Data from BindingDB
Found 3 hits for monomerid = 50157954
TargetCarbonic anhydrase 9(Homo sapiens (Human))
Harran University
Curated by ChEMBL
LigandPNGBDBM50157954(4-(4-Methyl-piperidin-1-yl)-N-(4-sulfamoyl-phenyl)...)
Affinity DataKi:  90nM. Assay description: Inhibitory potency against catalytic domain of human Carbonic anhydrase IX expressed in Escherichia coli strain BL21
In DepthDetails ArticlePubMed
TargetCarbonic anhydrase 2(Homo sapiens (Human))
Harran University
Curated by ChEMBL
LigandPNGBDBM50157954(4-(4-Methyl-piperidin-1-yl)-N-(4-sulfamoyl-phenyl)...)
Affinity DataKi:  265nM. Assay description: Inhibitory potency against human cloned Carbonic anhydrase II expressed in Escherichia coli strain BL21
In DepthDetails ArticlePubMed
TargetCarbonic anhydrase 1(Homo sapiens (Human))
Harran University
Curated by ChEMBL
LigandPNGBDBM50157954(4-(4-Methyl-piperidin-1-yl)-N-(4-sulfamoyl-phenyl)...)
Affinity DataKi:  820nM. Assay description: Inhibitory potency against human cloned Carbonic anhydrase I expressed in Escherichia coli strain BL21
In DepthDetails ArticlePubMed