BDBM50158369 CHEMBL3781561
SMILES Cc1nc(N)sc1-n1ccc(n1)C(F)(F)F
InChI Key InChIKey=JGGXTJSNPHMHSG-UHFFFAOYSA-N
Data  1 IC50
  Tab Delimited (TSV)   2D SDfile   Computed 3D by Vconf -m prep SDfile
Find this compound or compounds like it in BindingDB:
Activity Spreadsheet -- Enzyme Inhibition Constant Data from BindingDB
Found 1 hit for monomerid = 50158369
TargetProtein arginine N-methyltransferase 6(Homo sapiens (Human))
University Of Toronto
Curated by ChEMBL
LigandPNGBDBM50158369(CHEMBL3781561)
Affinity DataIC50:  4.60E+4nM. Assay description: Inhibition of N-terminal hexa-His tagged human PRMT6 expressed in Sf9 cells using 24 residues of biotin labelled histone4 substrate and tritiated 3H-...
In DepthDetails ArticlePubMed