BDBM50158395 CHEMBL3782037
SMILES CCn1cc(C[C@H](NC(=O)[C@@H]2CCC(=O)N2)C(=O)N2CCC[C@H]2C(N)=O)nc1I
InChI Key InChIKey=FEYNLKPAUFBURK-AVGNSLFASA-N
Data  2 IC50  4 EC50
  Tab Delimited (TSV)   2D SDfile   Computed 3D by Vconf -m prep SDfile
Find this compound or compounds like it in BindingDB:
Activity Spreadsheet -- Enzyme Inhibition Constant Data from BindingDB
Found 6 hits for monomerid = 50158395
TargetThyrotropin-releasing hormone receptor(MOUSE)
National Institute Of Pharmaceutical Education And Research
Curated by ChEMBL
LigandPNGBDBM50158395(CHEMBL3782037)
Affinity DataIC50:  1.18E+3nM. Assay description: Displacement of [3H]-Me-His-TRH from mouse TRH-R1 expressed in HEK293 cells preincubated for 15 mins measured after 4 hrs
In DepthDetails ArticlePubMed
TargetThyrotropin-releasing hormone receptor(Mus musculus)
National Institute Of Pharmaceutical Education And Research
Curated by ChEMBL
LigandPNGBDBM50158395(CHEMBL3782037)
Affinity DataEC50:  0.100nM. Assay description: Agonist activity at mouse TRH-R2 expressed in HEK293 cells assessed as Ca2+ release by FLIPR assay
In DepthDetails ArticlePubMed
TargetThyrotropin-releasing hormone receptor(Mus musculus)
National Institute Of Pharmaceutical Education And Research
Curated by ChEMBL
LigandPNGBDBM50158395(CHEMBL3782037)
Affinity DataEC50:  4nM. Assay description: Agonist activity at mouse TRH-R2 expressed in HEK293 cells assessed as IP1 formation after 1 hr by ELISA
In DepthDetails ArticlePubMed
TargetThyrotropin-releasing hormone receptor(Mus musculus)
National Institute Of Pharmaceutical Education And Research
Curated by ChEMBL
LigandPNGBDBM50158395(CHEMBL3782037)
Affinity DataIC50:  2.45E+3nM. Assay description: Displacement of [3H]-Me-His-TRH from mouse TRH-R2 expressed in HEK293 cells preincubated for 15 mins measured after 4 hrs
In DepthDetails ArticlePubMed
TargetThyrotropin-releasing hormone receptor(MOUSE)
National Institute Of Pharmaceutical Education And Research
Curated by ChEMBL
LigandPNGBDBM50158395(CHEMBL3782037)
Affinity DataEC50:  4.90nM. Assay description: Agonist activity at mouse TRH-R1 expressed in HEK293 cells assessed as Ca2+ release by FLIPR assay
In DepthDetails ArticlePubMed
TargetThyrotropin-releasing hormone receptor(MOUSE)
National Institute Of Pharmaceutical Education And Research
Curated by ChEMBL
LigandPNGBDBM50158395(CHEMBL3782037)
Affinity DataEC50:  13nM. Assay description: Agonist activity at mouse TRH-R1 expressed in HEK293 cells assessed as IP1 formation after 1 hr by ELISA
In DepthDetails ArticlePubMed