BDBM50158895 CHEMBL3787600
SMILES FC(F)(F)c1ccc(C2CCOc3cc(ccc23)S(=O)(=O)Nc2nncs2)c(c1)C1=CCNCC1
InChI Key InChIKey=NYKHTPZMAQHTTP-UHFFFAOYSA-N
Data  1 IC50
  Tab Delimited (TSV)   2D SDfile   Computed 3D by Vconf -m prep SDfile
Find this compound or compounds like it in BindingDB:
Activity Spreadsheet -- Enzyme Inhibition Constant Data from BindingDB
Found 1 hit for monomerid = 50158895
TargetSodium channel protein type 9 subunit alpha(Homo sapiens (Human))
Temple University
Curated by ChEMBL
LigandPNGBDBM50158895(CHEMBL3787600)
Affinity DataIC50:  4nM. Assay description: Inhibition of Nav1.7 (unknown origin) overexpressed in HEK293 cells preincubated for 15 to 20 mins followed by depolarization with 10 to 30 uM veratr...
In DepthDetails ArticlePubMed