BDBM50158984 CHEMBL427792::Sauvagine derivative
SMILES CC[C@H](C)[C@H](NC(=O)[C@@H](NC(=O)[C@H](CC(O)=O)NC(=O)[C@H](CC(C)C)NC(=O)[C@H](CC(C)C)NC(=O)[C@H](CC(C)C)NC(=O)[C@H](CCCN=C(N)N)NC(=O)[C@H](CC(N)=O)NC(=O)[C@H](CC(N)=O)NC(=O)[C@H](C)NC(=O)[C@H](C)NC(=O)[C@H](CCC(N)=O)NC(=O)[C@H](CCC(N)=O)NC(=O)[C@H](CCCCN)NC(=O)[C@H](CCC(O)=O)NC(=O)[C@H](CCCCN)NC(=O)[C@H](CCC(O)=O)NC(=O)[C@H](CCC(N)=O)NC(=O)[C@H](CCCCN)NC(=O)[C@H](CCC(O)=O)NC(=O)[C@@H](NC(=O)[C@H](CCC(O)=O)NC(=O)[C@@H](NC(=O)[C@H](CCSC)NC(=O)[C@H](CCCCN)NC(=O)[C@H](CCCN=C(N)N)NC(=O)[C@H](CC(C)C)NC(=O)[C@H](CC(C)C)NC(=O)[C@H](CCC(N)=O)NC(=O)[C@H](Cc1c[nH]cn1)NC(=O)[C@@H]1CCCN1C(=O)[C@H](CC(C)C)NC(=O)[C@H](CC(O)=O)NC(=O)[C@@H](NC(=O)[C@H](CO)NC(=O)[C@@H](NC(=O)[C@@H]1CCCN1C(=O)[C@@H]1CCCN1C(=O)CNC(=O)[C@@H]1CCC(=O)N1)[C@@H](C)CC)[C@@H](C)CC)[C@@H](C)CC)[C@@H](C)CC)[C@@H](C)O)C(O)=O
InChI Key InChIKey=XCXRFOVBAHLCPH-YEZVVHDNSA-N
Data  2 EC50
  Tab Delimited (TSV)   2D SDfile   Computed 3D by Vconf -m prep SDfile
Find this compound or compounds like it in BindingDB:
Activity Spreadsheet -- Enzyme Inhibition Constant Data from BindingDB
Found 2 hits for monomerid = 50158984
TargetCorticotropin-releasing factor receptor 1(MOUSE)
Procter & Gamble Pharmaceuticals
Curated by ChEMBL
LigandPNGBDBM50158984(CHEMBL427792 | Sauvagine derivative)
Affinity DataEC50:  445nM. Assay description: In vitro effective concentration for mouse corticotropin releasing factor 1 receptor
In DepthDetails ArticlePubMed
TargetCorticotropin-releasing factor receptor 2(Mus musculus)
Procter & Gamble Pharmaceuticals
Curated by ChEMBL
LigandPNGBDBM50158984(CHEMBL427792 | Sauvagine derivative)
Affinity DataEC50:  21nM. Assay description: In vitro effective concentration for mouse corticotropin releasing factor 2 receptor
In DepthDetails ArticlePubMed