BDBM50159151 CHEMBL3786145
SMILES OC(=O)C(F)(F)F.OC(=O)C(F)(F)F.OC(=O)C(F)(F)F.OC(=O)C(F)(F)F.CC[C@H](C)[C@H](NC(=O)[C@H](Cc1ccc(O)cc1)NC(=O)[C@@H](NC(=O)[C@H](CCCN\C(N)=N\C(=O)NCCCCN)NC(=O)[C@@H](N)CC(O)=O)C(C)C)C(=O)N[C@@H](Cc1cnc[nH]1)C(=O)N1CCC[C@H]1C(=O)N[C@@H](Cc1ccccc1)C(O)=O
InChI Key InChIKey=APPMXIIOSPZAMH-HJYQNBTFSA-N
Data  1 KI  1 IC50  2 EC50
  Tab Delimited (TSV)   2D SDfile   Computed 3D by Vconf -m prep SDfile
Find this compound or compounds like it in BindingDB:
Activity Spreadsheet -- Enzyme Inhibition Constant Data from BindingDB
Found 4 hits for monomerid = 50159151
TargetType-1 angiotensin II receptor(Homo sapiens (Human))
University Of Regensburg
Curated by ChEMBL
LigandPNGBDBM50159151(CHEMBL3786145)
Affinity DataKi:  2.10nM. Assay description: Displacement of [3H]-Asp-{Nomega-[N-(4-propanoylaminobutyl)aminocarbonyl]}Arg-ValTyr-Ile-His-Pro-Phe-OH Tris(hydrotrifluoroacetate) from human AT1 re...
In DepthDetails ArticlePubMed
TargetType-1 angiotensin II receptor(Homo sapiens (Human))
University Of Regensburg
Curated by ChEMBL
LigandPNGBDBM50159151(CHEMBL3786145)
Affinity DataIC50:  6.20nM. Assay description: Displacement of [3H]-Asp-{Nomega-[N-(4-propanoylaminobutyl)aminocarbonyl]}Arg-ValTyr-Ile-His-Pro-Phe-OH Tris(hydrotrifluoroacetate) from human AT1 re...
In DepthDetails ArticlePubMed
TargetType-1 angiotensin II receptor(Homo sapiens (Human))
University Of Regensburg
Curated by ChEMBL
LigandPNGBDBM50159151(CHEMBL3786145)
Affinity DataEC50:  1.40nM. Assay description: Agonist activity at human AT1 receptor transfected in CHO cells co-expressing Galpha16-mtAEQ assessed as induction of intracellular Ca2+ mobilization...
In DepthDetails ArticlePubMed
TargetType-1 angiotensin II receptor(Homo sapiens (Human))
University Of Regensburg
Curated by ChEMBL
LigandPNGBDBM50159151(CHEMBL3786145)
Affinity DataEC50:  1.40nM. Assay description: Agonist activity at human AT1 receptor transfected in CHO cells co-expressing Galpha16-mtAEQ assessed as induction of intracellular Ca2+ mobilization...
In DepthDetails ArticlePubMed