BDBM50159306 1,2,3-Triethoxy-5-[(Z)-2-(3-fluoro-4-methoxy-phenyl)-vinyl]-benzene::CHEMBL192357
SMILES CCOc1cc(\C=C/c2ccc(OC)c(F)c2)cc(OCC)c1OCC
InChI Key InChIKey=RJQUGRQWWZIMER-HJWRWDBZSA-N
Data  1 IC50
  Tab Delimited (TSV)   2D SDfile   Computed 3D by Vconf -m prep SDfile
Find this compound or compounds like it in BindingDB:
Activity Spreadsheet -- Enzyme Inhibition Constant Data from BindingDB
Found 1 hit for monomerid = 50159306
TargetTubulin beta-1 chain(Homo sapiens (Human))
University Of Salford
Curated by ChEMBL
LigandPNGBDBM50159306(1,2,3-Triethoxy-5-[(Z)-2-(3-fluoro-4-methoxy-pheny...)
Affinity DataIC50:  1.20E+3nM. Assay description: Concentration required for 50% inhibition of tubulin polymerization
In DepthDetails ArticlePubMed