BDBM50159375 CHEMBL179191::N-{(S)-3-[4-(1,1-Dioxo-1,2,3,6-tetrahydro-1lambda*6*-thiopyran-4-yl)-3-fluoro-phenyl]-2-oxo-oxazolidin-5-ylmethyl}-acetamide
SMILES CC(=O)NC[C@H]1CN(C(=O)O1)c1ccc(C2=CCS(=O)(=O)CC2)c(F)c1
InChI Key InChIKey=YITQMENCYIRIGK-AWEZNQCLSA-N
Data  1 KI
  Tab Delimited (TSV)   2D SDfile   Computed 3D by Vconf -m prep SDfile
Find this compound or compounds like it in BindingDB:
Activity Spreadsheet -- Enzyme Inhibition Constant Data from BindingDB
Found 1 hit for monomerid = 50159375
TargetAmine oxidase [flavin-containing] A(Homo sapiens (Human))
Astrazeneca Discovery
Curated by ChEMBL
LigandPNGBDBM50159375(CHEMBL179191 | N-{(S)-3-[4-(1,1-Dioxo-1,2,3,6-tetr...)
Affinity DataKi:  5.90E+3nM. Assay description: Binding affinity for human liver monoamine oxidase A
In DepthDetails ArticlePubMed