BDBM50159377 (R)-3-[4-(1,1-Dioxo-1,2,3,6-tetrahydro-1lambda*6*-thiopyran-4-yl)-3-fluoro-phenyl]-5-(4-isopropyl-[1,2,3]triazol-1-ylmethyl)-oxazolidin-2-one::CHEMBL367974
SMILES CC(C)c1cn(C[C@H]2CN(C(=O)O2)c2ccc(C3=CCS(=O)(=O)CC3)c(F)c2)nn1
InChI Key InChIKey=IAAMYGAUILRLIF-INIZCTEOSA-N
Data  1 KI
  Tab Delimited (TSV)   2D SDfile   Computed 3D by Vconf -m prep SDfile
Find this compound or compounds like it in BindingDB:
Activity Spreadsheet -- Enzyme Inhibition Constant Data from BindingDB
Found 1 hit for monomerid = 50159377
TargetAmine oxidase [flavin-containing] A(Homo sapiens (Human))
Astrazeneca Discovery
Curated by ChEMBL
LigandPNGBDBM50159377((R)-3-[4-(1,1-Dioxo-1,2,3,6-tetrahydro-1lambda*6*-...)
Affinity DataKi:  1.02E+5nM. Assay description: Binding affinity for human liver monoamine oxidase A
In DepthDetails ArticlePubMed