BDBM50159388 (R)-3-[4-(1,1-Dioxo-1,2,3,6-tetrahydro-1lambda*6*-thiopyran-4-yl)-3-fluoro-phenyl]-5-(5-fluoro-[1,2,3]triazol-1-ylmethyl)-oxazolidin-2-one::CHEMBL179190
SMILES Fc1cnnn1C[C@H]1CN(C(=O)O1)c1ccc(C2=CCS(=O)(=O)CC2)c(F)c1
InChI Key InChIKey=SJAIABNAHLTLCF-CYBMUJFWSA-N
Data  1 KI
  Tab Delimited (TSV)   2D SDfile   Computed 3D by Vconf -m prep SDfile
Find this compound or compounds like it in BindingDB:
Activity Spreadsheet -- Enzyme Inhibition Constant Data from BindingDB
Found 1 hit for monomerid = 50159388
TargetAmine oxidase [flavin-containing] A(Homo sapiens (Human))
Astrazeneca Discovery
Curated by ChEMBL
LigandPNGBDBM50159388((R)-3-[4-(1,1-Dioxo-1,2,3,6-tetrahydro-1lambda*6*-...)
Affinity DataKi:  1.60E+3nM. Assay description: Binding affinity for human liver monoamine oxidase A
In DepthDetails ArticlePubMed