BDBM50159395 CHEMBL440618::Des-AA1,2,5-[D-Agl8(NbetaMe,2-naphthoyl),IAmp9, m-I-Tyr11]SRIF
SMILES CC(C)NCc1ccc(C[C@@H]2NC(=O)[C@@H](NC(=O)[C@H](Cc3ccccc3)NC(=O)[C@@H](Cc3ccccc3)NC(=O)[C@@H](CCCCN)NC(=O)[C@H](N)CSSC[C@H](NC(=O)[C@H](CO)NC(=O)[C@H](NC(=O)[C@H](Cc3ccc(O)cc3I)NC(=O)[C@H](NC2=O)[C@@H](C)O)[C@@H](C)O)C(O)=O)N(C)C(=O)c2ccc3ccccc3c2)cc1
InChI Key InChIKey=ZHTQHERQPPHQPE-UJGSWJOCSA-N
Data  5 IC50
  Tab Delimited (TSV)   2D SDfile   Computed 3D by Vconf -m prep SDfile
Find this compound or compounds like it in BindingDB:
Activity Spreadsheet -- Enzyme Inhibition Constant Data from BindingDB
Found 5 hits for monomerid = 50159395
TargetSomatostatin receptor type 3(Homo sapiens (Human))
Salk Institute
Curated by ChEMBL
LigandPNGBDBM50159395(CHEMBL440618 | Des-AA1,2,5-[D-Agl8(NbetaMe,2-napht...)
Affinity DataIC50:  536nM. Assay description: Inhibition of [Leu8,D-Trp22,125I-Tyr25]SRIF-28 binding to human somatostatin receptor type 3
In DepthDetails ArticlePubMed
TargetSomatostatin receptor type 4(Homo sapiens (Human))
Salk Institute
Curated by ChEMBL
LigandPNGBDBM50159395(CHEMBL440618 | Des-AA1,2,5-[D-Agl8(NbetaMe,2-napht...)
Affinity DataIC50:  435nM. Assay description: Inhibition of [Leu8,D-Trp22,125I-Tyr25]SRIF-28 binding to human somatostatin receptor type 4
In DepthDetails ArticlePubMed
TargetSomatostatin receptor type 5(Homo sapiens (Human))
Salk Institute
Curated by ChEMBL
LigandPNGBDBM50159395(CHEMBL440618 | Des-AA1,2,5-[D-Agl8(NbetaMe,2-napht...)
Affinity DataIC50: >1.00E+3nM. Assay description: Inhibition of [Leu8,D-Trp22,125I-Tyr25]SRIF-28 binding to human somatostatin receptor type 5
In DepthDetails ArticlePubMed
TargetSomatostatin receptor type 2(Homo sapiens (Human))
Salk Institute
Curated by ChEMBL
LigandPNGBDBM50159395(CHEMBL440618 | Des-AA1,2,5-[D-Agl8(NbetaMe,2-napht...)
Affinity DataIC50: >1.00E+3nM. Assay description: Inhibition of [Leu8,D-Trp22,125I-Tyr25]SRIF-28 binding to human somatostatin receptor type 2
In DepthDetails ArticlePubMed
TargetSomatostatin receptor type 1(Homo sapiens (Human))
Salk Institute
Curated by ChEMBL
LigandPNGBDBM50159395(CHEMBL440618 | Des-AA1,2,5-[D-Agl8(NbetaMe,2-napht...)
Affinity DataIC50:  6.70nM. Assay description: Inhibition of [Leu8,D-Trp22,125I-Tyr25]SRIF-28 binding to human somatostatin receptor type 1
In DepthDetails ArticlePubMed