BDBM50159968 1,3-Dipropyl-8-{4-[5-(4-trifluoromethyl-phenyl)-[1,2,4]oxadiazol-3-ylmethoxy]-phenyl}-3,7-dihydro-purine-2,6-dione::CHEMBL178662
SMILES CCCn1c2nc([nH]c2c(=O)n(CCC)c1=O)-c1ccc(OCc2noc(n2)-c2ccc(cc2)C(F)(F)F)cc1
InChI Key InChIKey=SEEWEGGTAWVJKR-UHFFFAOYSA-N
Data  3 KI
  Tab Delimited (TSV)   2D SDfile   Computed 3D by Vconf -m prep SDfile
Find this compound or compounds like it in BindingDB:
Activity Spreadsheet -- Enzyme Inhibition Constant Data from BindingDB
Found 3 hits for monomerid = 50159968
TargetAdenosine receptor A2b(Homo sapiens (Human))
Cv Therapeutics
Curated by ChEMBL
LigandPNGBDBM50159968(1,3-Dipropyl-8-{4-[5-(4-trifluoromethyl-phenyl)-[1...)
Affinity DataKi:  255nM. Assay description: Binding affinity for adenosine A2b receptor by using as [3H]-ZM-241,385 (14 nM) radioligand in membranes from HEK-A2B cells
In DepthDetails ArticlePubMed
TargetAdenosine receptor A2a(Homo sapiens (Human))
Cv Therapeutics
Curated by ChEMBL
LigandPNGBDBM50159968(1,3-Dipropyl-8-{4-[5-(4-trifluoromethyl-phenyl)-[1...)
Affinity DataKi:  4.91E+3nM. Assay description: Binding affinity for adenosine A2a receptor by using as [3H]-ZM-241,385 (2 nM) radioligand in membranes from HEK-A2A cells
In DepthDetails ArticlePubMed
TargetAdenosine receptor A1(Homo sapiens (Human))
Cv Therapeutics
Curated by ChEMBL
LigandPNGBDBM50159968(1,3-Dipropyl-8-{4-[5-(4-trifluoromethyl-phenyl)-[1...)
Affinity DataKi:  5.18E+3nM. Assay description: Binding affinity for adenosine A1 receptor by using as [3H]-CPX (0.5 nM) radioligand in membranes from Chinese hamster ovary cells
In DepthDetails ArticlePubMed