BDBM50159989 CHEMBL3785178
SMILES CC(C)CC(=O)NCc1cccc(c1)S(=O)(=O)NC(=O)c1[nH]c2c(-c3c(C)nn(C)c3C)c(Cl)ccc2c1CCCOc1cc(C)c(Cl)c(C)c1
InChI Key InChIKey=DDQBTVMWOYEMLA-UHFFFAOYSA-N
Data  4 KI
  Tab Delimited (TSV)   2D SDfile   Computed 3D by Vconf -m prep SDfile
Find this compound or compounds like it in BindingDB:
Activity Spreadsheet -- Enzyme Inhibition Constant Data from BindingDB
Found 4 hits for monomerid = 50159989
TargetInduced myeloid leukemia cell differentiation protein Mcl-1(Homo sapiens (Human))
Vanderbilt University School Of Medicine
Curated by ChEMBL
LigandPNGBDBM50159989(CHEMBL3785178)
Affinity DataKi:  5.60nM. Assay description: Displacement of mixture of 4- and 5-(N-(7-(1-(2-((6-(3-carboxy-4-(6-hydroxy-3-oxo-3Hxanthen-9-yl)benzamido)hexyl)amino)-2-oxoethyl)-3,5-dimethyl-1H-p...
In DepthDetails ArticlePubMed
TargetInduced myeloid leukemia cell differentiation protein Mcl-1(Homo sapiens (Human))
Vanderbilt University School Of Medicine
Curated by ChEMBL
LigandPNGBDBM50159989(CHEMBL3785178)
Affinity DataKi: <10nM. Assay description: Displacement of FITC-Bak-BH3 peptide probe from N-terminal His-tagged human Mcl-1 (172 to 327 residues) expressed in Escherichia coli BL21(DE3) after...
In DepthDetails ArticlePubMed
TargetInduced myeloid leukemia cell differentiation protein Mcl-1(Homo sapiens (Human))
Vanderbilt University School Of Medicine
Curated by ChEMBL
LigandPNGBDBM50159989(CHEMBL3785178)
Affinity DataKi:  92nM. Assay description: Displacement of FITC-Bak-BH3 peptide probe from N-terminal His-tagged human Mcl-1 (172 to 327 residues) expressed in Escherichia coli BL21(DE3) after...
In DepthDetails ArticlePubMed
TargetBcl-2-like protein 1(Homo sapiens (Human))
Vanderbilt University School Of Medicine
Curated by ChEMBL
LigandPNGBDBM50159989(CHEMBL3785178)
Affinity DataKi:  1.57E+3nM. Assay description: Binding affinity to Bcl-xL (unknown origin) after 1.5 hrs by FPA assay
In DepthDetails ArticlePubMed