BDBM50160156 1-(Biphenyl-2-yloxy)-4-imino-4-piperidin-1-yl-butan-2-ol::CHEMBL181583
SMILES OC(COc1ccccc1-c1ccccc1)CC(=N)N1CCCCC1
InChI Key InChIKey=HSVZQQYIMKLNLN-UHFFFAOYSA-N
Data  1 KI
  Tab Delimited (TSV)   2D SDfile   Computed 3D by Vconf -m prep SDfile
Find this compound or compounds like it in BindingDB:
Activity Spreadsheet -- Enzyme Inhibition Constant Data from BindingDB
Found 1 hit for monomerid = 50160156
TargetAlpha-1A adrenergic receptor(Homo sapiens (Human))
China Pharmaceutical University
Curated by ChEMBL
LigandPNGBDBM50160156(1-(Biphenyl-2-yloxy)-4-imino-4-piperidin-1-yl-buta...)
Affinity DataKi:  2.50E+3nM. Assay description: Binding constant measured against Alpha-1A adrenergic receptor in human prostate; +:inactive
In DepthDetails ArticlePubMed