BDBM50160159 2-{3-[4-(5-Chloro-2-methoxy-phenyl)-piperazin-1-yl]-propylamino}-pyrimidine-4-carboxylic acid amide::CHEMBL24981
SMILES COc1ccc(Cl)cc1N1CCN(CCCNc2nccc(n2)C(N)=O)CC1
InChI Key InChIKey=NNPHPGSVPQWUHP-UHFFFAOYSA-N
Data  1 KI
  Tab Delimited (TSV)   2D SDfile   Computed 3D by Vconf -m prep SDfile
Find this compound or compounds like it in BindingDB:
Activity Spreadsheet -- Enzyme Inhibition Constant Data from BindingDB
Found 1 hit for monomerid = 50160159
TargetAlpha-1A adrenergic receptor(Homo sapiens (Human))
China Pharmaceutical University
Curated by ChEMBL
LigandPNGBDBM50160159(2-{3-[4-(5-Chloro-2-methoxy-phenyl)-piperazin-1-yl...)
Affinity DataKi:  2nM. Assay description: Binding constant measured against Alpha-1A adrenergic receptor in human prostate; ++:moderately active
In DepthDetails ArticlePubMed