BDBM50160344 Acetic acid 5-[2-(3,4-dichloro-benzylamino)-6-oxo-1,6-dihydro-purin-7-yl]-pentyl ester::CHEMBL361838
SMILES CC(=O)OCCCCCn1cnc2nc(NCc3ccc(Cl)c(Cl)c3)[nH]c(=O)c12
InChI Key InChIKey=DRTFCWGXCOANMR-UHFFFAOYSA-N
Data  3 KI
  Tab Delimited (TSV)   2D SDfile   Computed 3D by Vconf -m prep SDfile
Find this compound or compounds like it in BindingDB:
Activity Spreadsheet -- Enzyme Inhibition Constant Data from BindingDB
Found 3 hits for monomerid = 50160344
TargetDNA polymerase III PolC-type(Bacillus subtilis)
Glsynthesis
Curated by ChEMBL
LigandPNGBDBM50160344(Acetic acid 5-[2-(3,4-dichloro-benzylamino)-6-oxo-...)
Affinity DataKi:  52nM. Assay description: Inhibitory constant against DNA polymerases IIIC produced by Bacillus subtilis; (a)
In DepthDetails ArticlePubMed
TargetDNA polymerase III subunit alpha(Bacillus subtilis)
Glsynthesis
Curated by ChEMBL
LigandPNGBDBM50160344(Acetic acid 5-[2-(3,4-dichloro-benzylamino)-6-oxo-...)
Affinity DataKi:  58nM. Assay description: Inhibitory constant against DNA polymerases IIIE from Bacillus subtilis; (a)
In DepthDetails ArticlePubMed
TargetDNA polymerase III subunit alpha(Escherichia coli)
Glsynthesis
Curated by ChEMBL
LigandPNGBDBM50160344(Acetic acid 5-[2-(3,4-dichloro-benzylamino)-6-oxo-...)
Affinity DataKi:  1.38E+4nM. Assay description: Inhibitory constant against DNA polymerases IIIE from Escherichia coli; (a)
In DepthDetails ArticlePubMed