BDBM50160359 2-(3,4-Dichloro-benzylamino)-9-(4-hydroxy-butyl)-1,9-dihydro-purin-6-one::CHEMBL182072
SMILES OCCCCn1cnc2c1nc(NCc1ccc(Cl)c(Cl)c1)[nH]c2=O
InChI Key InChIKey=MXZSROXOTCJLTP-UHFFFAOYSA-N
Data  2 KI
  Tab Delimited (TSV)   2D SDfile   Computed 3D by Vconf -m prep SDfile
Find this compound or compounds like it in BindingDB:
Activity Spreadsheet -- Enzyme Inhibition Constant Data from BindingDB
Found 2 hits for monomerid = 50160359
TargetDNA polymerase III subunit alpha(Bacillus subtilis)
Glsynthesis
Curated by ChEMBL
LigandPNGBDBM50160359(2-(3,4-Dichloro-benzylamino)-9-(4-hydroxy-butyl)-1...)
Affinity DataKi:  1.60E+3nM. Assay description: Inhibitory constant against DNA polymerases IIIE from Bacillus subtilis; (a)
In DepthDetails ArticlePubMed
TargetDNA polymerase III PolC-type(Bacillus subtilis)
Glsynthesis
Curated by ChEMBL
LigandPNGBDBM50160359(2-(3,4-Dichloro-benzylamino)-9-(4-hydroxy-butyl)-1...)
Affinity DataKi:  7.12E+5nM. Assay description: Inhibitory constant against DNA polymerases IIIC produced by Bacillus subtilis; (a)
In DepthDetails ArticlePubMed