BDBM50160601 CHEMBL180817::[4-(5-Fluoro-1H-indol-3-yl)-cyclohexyl]-[2-(2-methoxy-phenoxy)-ethyl]-amine
SMILES COc1ccccc1OCCN[C@H]1CC[C@H](CC1)c1c[nH]c2ccc(F)cc12
InChI Key InChIKey=VBRHXFSHZGCBJG-MAEOIBBWSA-N
Data  2 KI
  Tab Delimited (TSV)   2D SDfile   Computed 3D by Vconf -m prep SDfile
Find this compound or compounds like it in BindingDB:
Activity Spreadsheet -- Enzyme Inhibition Constant Data from BindingDB
Found 2 hits for monomerid = 50160601
TargetSodium-dependent serotonin transporter(Rattus norvegicus (rat))
Wyeth Research
Curated by ChEMBL
LigandPNGBDBM50160601(CHEMBL180817 | [4-(5-Fluoro-1H-indol-3-yl)-cyclohe...)
Affinity DataKi:  3.98nM. Assay description: Binding affinity determined against Serotonin transporter determined bydisplacement of [3H]-paroxetine from rat cortical membranes
In DepthDetails ArticlePubMed
Target5-hydroxytryptamine receptor 1A(Homo sapiens (Human))
Wyeth Research
Curated by ChEMBL
LigandPNGBDBM50160601(CHEMBL180817 | [4-(5-Fluoro-1H-indol-3-yl)-cyclohe...)
Affinity DataKi:  307nM. Assay description: Binding affinity determined against human 5-hydroxytryptamine 1A receptors transfected into CHO cells.
In DepthDetails ArticlePubMed