BDBM50160644 3-Methoxy-benzoic acid 3-(6-methyl-pyridin-2-ylethynyl)-phenyl ester::CHEMBL182508
SMILES COc1cccc(c1)C(=O)Oc1cccc(c1)C#Cc1cccc(C)n1
InChI Key InChIKey=QSGJAAHHFMNOFR-UHFFFAOYSA-N
Data  1 IC50
  Tab Delimited (TSV)   2D SDfile   Computed 3D by Vconf -m prep SDfile
Find this compound or compounds like it in BindingDB:
Activity Spreadsheet -- Enzyme Inhibition Constant Data from BindingDB
Found 1 hit for monomerid = 50160644
TargetMetabotropic glutamate receptor 5(Rattus norvegicus (Rat))
Yale University
Curated by ChEMBL
LigandPNGBDBM50160644(3-Methoxy-benzoic acid 3-(6-methyl-pyridin-2-yleth...)
Affinity DataIC50:  1.72E+3nM. Assay description: Concentration required for 50% growth inhibition of rat metabotropic glutamate receptor 5 was determined using inositol phosphate hydrolysis assay
In DepthDetails ArticlePubMed