BDBM50160653 CHEMBL446620::Furan-2-carboxylic acid 3-(6-methyl-pyridin-2-ylethynyl)-phenyl ester
SMILES Cc1cccc(n1)C#Cc1cccc(OC(=O)c2ccco2)c1
InChI Key InChIKey=GJUUHTXRWHKGEG-UHFFFAOYSA-N
Data  1 IC50
  Tab Delimited (TSV)   2D SDfile   Computed 3D by Vconf -m prep SDfile
Find this compound or compounds like it in BindingDB:
Activity Spreadsheet -- Enzyme Inhibition Constant Data from BindingDB
Found 1 hit for monomerid = 50160653
TargetMetabotropic glutamate receptor 5(Rattus norvegicus (Rat))
Yale University
Curated by ChEMBL
LigandPNGBDBM50160653(CHEMBL446620 | Furan-2-carboxylic acid 3-(6-methyl...)
Affinity DataIC50:  1.01E+3nM. Assay description: Concentration required for 50% growth inhibition of rat metabotropic glutamate receptor 5 was determined using inositol phosphate hydrolysis assay
In DepthDetails ArticlePubMed