BDBM50160669 4-(N-Methyl-hydrazino)-benzenesulfonamide::CHEMBL183913
SMILES CN(N)c1ccc(cc1)S(N)(=O)=O
InChI Key InChIKey=XGAFGUJHKUYKIM-UHFFFAOYSA-N
Data  3 KI
  Tab Delimited (TSV)   2D SDfile   Computed 3D by Vconf -m prep SDfile
Find this compound or compounds like it in BindingDB:
Activity Spreadsheet -- Enzyme Inhibition Constant Data from BindingDB
Found 3 hits for monomerid = 50160669
TargetCarbonic anhydrase 12(Homo sapiens (Human))
Universit£
Curated by ChEMBL
LigandPNGBDBM50160669(4-(N-Methyl-hydrazino)-benzenesulfonamide | CHEMBL...)
Affinity DataKi:  11nM. Assay description: Ki value against human carbonic anhydrase XII (hCA XII)
In DepthDetails ArticlePubMed
TargetCarbonic anhydrase 2(Homo sapiens (Human))
Universit£
Curated by ChEMBL
LigandPNGBDBM50160669(4-(N-Methyl-hydrazino)-benzenesulfonamide | CHEMBL...)
Affinity DataKi:  300nM. Assay description: Ki value against human carbonic anhydrase II (hCA II)
In DepthDetails ArticlePubMed
TargetCarbonic anhydrase 1(Homo sapiens (Human))
Universit£
Curated by ChEMBL
LigandPNGBDBM50160669(4-(N-Methyl-hydrazino)-benzenesulfonamide | CHEMBL...)
Affinity DataKi:  2.80E+4nM. Assay description: Ki value against human carbonic anhydrase I (hCA I)
In DepthDetails ArticlePubMed