BDBM50160850 1-[4-(Benzo[1,3]dioxol-5-yloxy)-phenyl]-1,7,9-triaza-spiro[4.5]decane-2,6,8,10-tetraone::CHEMBL178749
SMILES O=C1CCC2(N1c1ccc(Oc3ccc4OCOc4c3)cc1)C(=O)NC(=O)NC2=O
InChI Key InChIKey=DMWFWKLZKONSAG-UHFFFAOYSA-N
Data  1 KI
  Tab Delimited (TSV)   2D SDfile   Computed 3D by Vconf -m prep SDfile
Find this compound or compounds like it in BindingDB:
Activity Spreadsheet -- Enzyme Inhibition Constant Data from BindingDB
Found 1 hit for monomerid = 50160850
TargetCollagenase 3(Homo sapiens (Human))
Pharmaceutical Research Institute
Curated by ChEMBL
LigandPNGBDBM50160850(1-[4-(Benzo[1,3]dioxol-5-yloxy)-phenyl]-1,7,9-tria...)
Affinity DataKi:  5.80nM. Assay description: Inhibition of matrix metalloprotease-13
In DepthDetails ArticlePubMed