BDBM50160897 3-[4-(4-Bromo-thiophen-3-yl)-phenyl]-8-methyl-8-aza-bicyclo[3.2.1]octane-2-carboxylic acid methyl ester::CHEMBL433560
SMILES COC(=O)C1C2CCC(CC1c1ccc(cc1)-c1cscc1Br)N2C
InChI Key InChIKey=AKZNIBWGGYEGKL-UHFFFAOYSA-N
Data  3 KI
  Tab Delimited (TSV)   2D SDfile   Computed 3D by Vconf -m prep SDfile
Find this compound or compounds like it in BindingDB:
Activity Spreadsheet -- Enzyme Inhibition Constant Data from BindingDB
Found 3 hits for monomerid = 50160897
TargetSodium-dependent serotonin transporter(Rattus norvegicus (rat))
Yale University
Curated by ChEMBL
LigandPNGBDBM50160897(3-[4-(4-Bromo-thiophen-3-yl)-phenyl]-8-methyl-8-az...)
Affinity DataKi:  4.02nM. Assay description: Displacement of [3H]paroxetine from serotonin transporter of rat cerebral cortex
In DepthDetails ArticlePubMed
TargetSodium-dependent dopamine transporter(Rattus norvegicus (rat))
Yale University
Curated by ChEMBL
LigandPNGBDBM50160897(3-[4-(4-Bromo-thiophen-3-yl)-phenyl]-8-methyl-8-az...)
Affinity DataKi:  183nM. Assay description: Displacement of [3H]GBR-12935 from dopamine transporter of rat caudate-putamen
In DepthDetails ArticlePubMed
TargetTransporter(Rattus norvegicus)
Yale University
Curated by ChEMBL
LigandPNGBDBM50160897(3-[4-(4-Bromo-thiophen-3-yl)-phenyl]-8-methyl-8-az...)
Affinity DataKi: >1.00E+4nM. Assay description: Displacement of [3H]nisoxetine from norepinephrine transporter of rat cerebral cortex
In DepthDetails ArticlePubMed