BDBM50160910 CHEMBL184779::{3-[3-(2-Benzyloxy-5-chloro-phenyl)-thiophen-2-yl]-phenyl}-acetic acid
SMILES OC(=O)Cc1cccc(c1)-c1sccc1-c1cc(Cl)ccc1OCc1ccccc1
InChI Key InChIKey=PNVFGVWWQZJNKR-UHFFFAOYSA-N
Data  3 KI
  Tab Delimited (TSV)   2D SDfile   Computed 3D by Vconf -m prep SDfile
Find this compound or compounds like it in BindingDB:
Activity Spreadsheet -- Enzyme Inhibition Constant Data from BindingDB
Found 3 hits for monomerid = 50160910
TargetProstaglandin E2 receptor EP1 subtype(Homo sapiens (Human))
Merck Frosst Centre For Therapeutic Research
Curated by ChEMBL
LigandPNGBDBM50160910(CHEMBL184779 | {3-[3-(2-Benzyloxy-5-chloro-phenyl)...)
Affinity DataKi:  15nM. Assay description: Binding affinity against Prostaglandin E receptor was determined in human
In DepthDetails ArticlePubMed
TargetThromboxane A2 receptor(Homo sapiens (Human))
Merck Frosst Centre For Therapeutic Research
Curated by ChEMBL
LigandPNGBDBM50160910(CHEMBL184779 | {3-[3-(2-Benzyloxy-5-chloro-phenyl)...)
Affinity DataKi:  150nM. Assay description: Binding affinity against human Prostanoid TP receptor
In DepthDetails ArticlePubMed
TargetProstaglandin E2 receptor EP1 subtype(Homo sapiens (Human))
Merck Frosst Centre For Therapeutic Research
Curated by ChEMBL
LigandPNGBDBM50160910(CHEMBL184779 | {3-[3-(2-Benzyloxy-5-chloro-phenyl)...)
Affinity DataKi:  220nM. Assay description: Binding affinity against Prostaglandin E receptor in presence of 2% human serum albumin
In DepthDetails ArticlePubMed