BDBM50161110 CHEMBL3792639
SMILES Cc1cc(O)ccc1-c1ccc(cc1)N(CC(F)(F)F)S(=O)(=O)c1cccc2n(C)ccc12
InChI Key InChIKey=BTTHVHBJKLEXKW-UHFFFAOYSA-N
Data  1 IC50
  Tab Delimited (TSV)   2D SDfile   Computed 3D by Vconf -m prep SDfile
Find this compound or compounds like it in BindingDB:
Activity Spreadsheet -- Enzyme Inhibition Constant Data from BindingDB
Found 1 hit for monomerid = 50161110
TargetNuclear receptor ROR-gamma(Homo sapiens (Human))
Biogen
Curated by ChEMBL
LigandPNGBDBM50161110(CHEMBL3792639)
Affinity DataIC50:  210nM. Assay description: Inverse agonist activity at recombinant human GST-tagged ROR-gamma receptor ligand binding domain assessed as inhibition of receptor and co-activator...
In DepthDetails ArticlePubMed