BDBM50161253 CHEMBL426228::Uscharin derivative
SMILES C[C@@H]1C[C@]2(SCC(N)=N2)C2(O[Si](C)(C)C)O[C@@H]3C[C@@]4(COC(C)=O)[C@@H](CC[C@@H]5[C@@H]4CC[C@]4(C)[C@H](CC[C@]54CO[Si](C)(C)C)C4=CC(=O)OC4)C[C@H]3O[C@@H]2O1
InChI Key InChIKey=QSWOISMHTAQYAR-BILQYLQXSA-N
Data  1 IC50
  Tab Delimited (TSV)   2D SDfile   Computed 3D by Vconf -m prep SDfile
Find this compound or compounds like it in BindingDB:
Activity Spreadsheet -- Enzyme Inhibition Constant Data from BindingDB
Found 1 hit for monomerid = 50161253
TargetSodium/potassium-transporting ATPase subunit alpha-1(Sus scrofa)
Unibioscreen
Curated by ChEMBL
LigandPNGBDBM50161253(CHEMBL426228 | Uscharin derivative)
Affinity DataIC50: >5.00E+4nM. Assay description: In vitro inhibitory activity against porcine Na+/K+-ATPase
In DepthDetails ArticlePubMed