BDBM50161270 CHEMBL3786565
SMILES COc1ccc(CNC(=O)CCN2C(=O)NC(C2=O)(c2ccccc2)c2ccccc2)cc1
InChI Key InChIKey=LQYKWDLNENUREX-UHFFFAOYSA-N
Data  2 IC50
  Tab Delimited (TSV)   2D SDfile   Computed 3D by Vconf -m prep SDfile
Find this compound or compounds like it in BindingDB:
Activity Spreadsheet -- Enzyme Inhibition Constant Data from BindingDB
Found 2 hits for monomerid = 50161270
TargetProstaglandin G/H synthase 2(Ovis aries (Sheep))
King Saud University
Curated by ChEMBL
LigandPNGBDBM50161270(CHEMBL3786565)
Affinity DataIC50:  1.32E+3nM. Assay description: Inhibition of ovine COX2 assessed as reduction in PGH2-dervied PGF2alpha production preincubated for 5 mins followed by addition of arachidonic acid ...
In DepthDetails ArticlePubMed
TargetProstaglandin G/H synthase 1(Ovis aries (Sheep))
King Saud University
Curated by ChEMBL
LigandPNGBDBM50161270(CHEMBL3786565)
Affinity DataIC50: >1.00E+5nM. Assay description: Inhibition of ovine COX1 preincubated for 5 mins followed by addition of arachidonic acid as substrate measured after 2 mins by enzyme immunoassay
In DepthDetails ArticlePubMed