BDBM50161394 (4R,5R)-5-Ethyl-4-methyl-selenazolidin-(2Z)-ylideneamine::CHEMBL178205
SMILES CC[C@H]1[Se]C(N)=N[C@@H]1C
InChI Key InChIKey=KGDKLNPRYLLBRV-RFZPGFLSSA-N
Data  2 IC50
  Tab Delimited (TSV)   2D SDfile   Computed 3D by Vconf -m prep SDfile
Find this compound or compounds like it in BindingDB:
Activity Spreadsheet -- Enzyme Inhibition Constant Data from BindingDB
Found 2 hits for monomerid = 50161394
TargetNitric oxide synthase, brain(Homo sapiens (Human))
Dainippon Pharmaceutical
Curated by ChEMBL
LigandPNGBDBM50161394((4R,5R)-5-Ethyl-4-methyl-selenazolidin-(2Z)-yliden...)
Affinity DataIC50:  790nM. Assay description: Inhibitory concentration against neuronal nitric acid synthase
In DepthDetails ArticlePubMed
TargetNitric oxide synthase, inducible(Homo sapiens (Human))
Dainippon Pharmaceutical
Curated by ChEMBL
LigandPNGBDBM50161394((4R,5R)-5-Ethyl-4-methyl-selenazolidin-(2Z)-yliden...)
Affinity DataIC50:  9.30nM. Assay description: Inhibitory concentration against inducible nitric acid synthase
In DepthDetails ArticlePubMed