BDBM50161670 3-[3-(5-Chloro-thiazol-2-yl)-1-cyclopentylmethyl-ureido]-benzamide::CHEMBL178370
SMILES NC(=O)c1cccc(c1)N(CC1CCCC1)C(=O)Nc1ncc(Cl)s1
InChI Key InChIKey=VYUDJKSROHWXHU-UHFFFAOYSA-N
Data  1 EC50
  Tab Delimited (TSV)   2D SDfile   Computed 3D by Vconf -m prep SDfile
Find this compound or compounds like it in BindingDB:
Activity Spreadsheet -- Enzyme Inhibition Constant Data from BindingDB
Found 1 hit for monomerid = 50161670
TargetHexokinase-4(Rattus norvegicus)
Osi Pharmaceuticals
Curated by ChEMBL
LigandPNGBDBM50161670(3-[3-(5-Chloro-thiazol-2-yl)-1-cyclopentylmethyl-u...)
Affinity DataEC50:  1.00E+3nM. Assay description: Effective concentration for glucokinase activation with 5 mM glucose
In DepthDetails ArticlePubMed