BDBM50161683 3-(5-Chloro-thiazol-2-yl)-1-(4-methanesulfonyl-phenyl)-1-(tetrahydro-pyran-4-ylmethyl)-urea::CHEMBL178813
SMILES CS(=O)(=O)c1ccc(cc1)N(CC1CCOCC1)C(=O)Nc1ncc(Cl)s1
InChI Key InChIKey=FRMVYVFJQUIGOY-UHFFFAOYSA-N
Data  1 EC50
  Tab Delimited (TSV)   2D SDfile   Computed 3D by Vconf -m prep SDfile
Find this compound or compounds like it in BindingDB:
Activity Spreadsheet -- Enzyme Inhibition Constant Data from BindingDB
Found 1 hit for monomerid = 50161683
TargetHexokinase-4(Rattus norvegicus)
Osi Pharmaceuticals
Curated by ChEMBL
LigandPNGBDBM50161683(3-(5-Chloro-thiazol-2-yl)-1-(4-methanesulfonyl-phe...)
Affinity DataEC50:  4.90E+3nM. Assay description: Effective concentration for glucokinase activation with 5 mM glucose
In DepthDetails ArticlePubMed