BDBM50161688 3-(5-Chloro-thiazol-2-yl)-1-(4-methanesulfonyl-phenyl)-1-thiophen-2-ylmethyl-urea::CHEMBL178392
SMILES CS(=O)(=O)c1ccc(cc1)N(Cc1cccs1)C(=O)Nc1ncc(Cl)s1
InChI Key InChIKey=MGLWWYZPJXNNMY-UHFFFAOYSA-N
Data  1 EC50
  Tab Delimited (TSV)   2D SDfile   Computed 3D by Vconf -m prep SDfile
Find this compound or compounds like it in BindingDB:
Activity Spreadsheet -- Enzyme Inhibition Constant Data from BindingDB
Found 1 hit for monomerid = 50161688
TargetHexokinase-4(Rattus norvegicus)
Osi Pharmaceuticals
Curated by ChEMBL
LigandPNGBDBM50161688(3-(5-Chloro-thiazol-2-yl)-1-(4-methanesulfonyl-phe...)
Affinity DataEC50:  6.60E+3nM. Assay description: Effective concentration for glucokinase activation with 5 mM glucose
In DepthDetails ArticlePubMed