BDBM50161692 1-(3-Chloro-4-methyl-phenyl)-3-(5-chloro-thiazol-2-yl)-1-cyclopentylmethyl-urea::CHEMBL181943
SMILES Cc1ccc(cc1Cl)N(CC1CCCC1)C(=O)Nc1ncc(Cl)s1
InChI Key InChIKey=LFWCLZZNWIRTLS-UHFFFAOYSA-N
Data  1 EC50
  Tab Delimited (TSV)   2D SDfile   Computed 3D by Vconf -m prep SDfile
Find this compound or compounds like it in BindingDB:
Activity Spreadsheet -- Enzyme Inhibition Constant Data from BindingDB
Found 1 hit for monomerid = 50161692
TargetHexokinase-4(Rattus norvegicus)
Osi Pharmaceuticals
Curated by ChEMBL
LigandPNGBDBM50161692(1-(3-Chloro-4-methyl-phenyl)-3-(5-chloro-thiazol-2...)
Affinity DataEC50:  400nM. Assay description: Effective concentration for glucokinase activation with 5 mM glucose
In DepthDetails ArticlePubMed